Reaction Details
TargetAlkaline phosphatase, tissue-nonspecific isozyme
LigandBDBM15236
Substrate/Competitorn/a
Meas. Tech.Dose Response confirmation of uHTS inhibitors of Mouse Intestinal Alkaline Phosphatase using Tissue Nonspecific Alkaline Phosphatase.
IC50 33200±n/a nM
Citation PubChem, PC Dose Response confirmation of uHTS inhibitors of Mouse Intestinal Alkaline Phosphatase using Tissue Nonspecific Alkaline Phosphatase. PubChem Bioassay(2010)[AID]
 
Alkaline phosphatase, tissue-nonspecific isozyme
Name:Alkaline phosphatase, tissue-nonspecific isozyme
Type:PROTEIN
Mol. Mass.:57306.17
Organism:Homo sapiens (Human)
Description:ChEMBL_1448917
Residue:524
BDBM15236
NameBDBM15236
Synonyms:3,5,7-trihydroxy-2-(3,4,5-trihydroxyphenyl)-4H-chromen-4-one CHEMBL164 Myricetin Myricetin (Myr) | cid_5281672
TypeSmall organic molecule
Emp. Form.C15H10O8
Mol. Mass.318.2351
SMILESOc1cc(O)c2c(c1)oc(-c1cc(O)c(O)c(O)c1)c(O)c2=O