Reaction Details
TargetProtein RecA
LigandBDBM70489
Substrate/Competitorn/a
Meas. Tech.Intein inhibitors as potential Tuberculosis drugs
IC50 13660±n/a nM
Citation PubChem, PC Intein inhibitors as potential Tuberculosis drugs PubChem Bioassay(2010)[AID]
 
Protein RecA
Name:Protein RecA
Type:Enzyme Catalytic Domain
Mol. Mass.:85386.52
Organism:Mycobacterium tuberculosis H37Rv
Description:gi_15609874
Residue:790
BDBM70489
NameBDBM70489
Synonyms:1-(3-methylbenzyl)-1H-naphtho[2,3-d][1,2,3]triazole-4,9-dione 3-[(3-methylphenyl)methyl]benzo[f]benzotriazole-4,9-dione SMR000115594 | cid_849734
TypeSmall organic molecule
Emp. Form.C18H13N3O2
Mol. Mass.303.3147
SMILESCc1cccc(Cn2nnc3c2C(=O)c2ccccc2C3=O)c1