Reaction Details
TargetRecBCD enzyme subunit RecD
LigandBDBM57102
Substrate/Competitorn/a
Meas. Tech.Counterscreen for AddAB inhibitors: absorbance-based bacterial cell-based high throughput dose response assay to identify inhibitors of RecBCD
IC50>39496±n/a nM
Citation PubChem, PC Counterscreen for AddAB inhibitors: absorbance-based bacterial cell-based high throughput dose response assay to identify inhibitors of RecBCD PubChem Bioassay(2010)[AID]
 
RecBCD enzyme subunit RecD
Name:RecBCD enzyme subunit RecD
Type:Enzyme Catalytic Domain
Mol. Mass.:66906.68
Organism:Escherichia coli str. K-12 substr. MG1655
Description:gi_16130723
Residue:608
BDBM57102
NameBDBM57102
Synonyms:MLS000541562 N-cyclohexyl-6-phenyl-3-pyridin-2-yl-1,2,4-triazin-5-amine cid_6404647 | cyclohexyl-[6-phenyl-3-(2-pyridyl)-1,2,4-triazin-5-yl]amine
TypeSmall organic molecule
Emp. Form.C20H21N5
Mol. Mass.331.4142
SMILESC1CCC(CC1)Nc1nc(nnc1-c1ccccc1)-c1ccccn1