Reaction Details
TargetRecBCD enzyme subunit RecD
LigandBDBM58879
Substrate/Competitorn/a
Meas. Tech.Counterscreen for AddAB inhibitors: absorbance-based bacterial cell-based high throughput dose response assay to identify inhibitors of RecBCD
IC50 20120±n/a nM
Citation PubChem, PC Counterscreen for AddAB inhibitors: absorbance-based bacterial cell-based high throughput dose response assay to identify inhibitors of RecBCD PubChem Bioassay(2010)[AID]
 
RecBCD enzyme subunit RecD
Name:RecBCD enzyme subunit RecD
Type:Enzyme Catalytic Domain
Mol. Mass.:66906.68
Organism:Escherichia coli str. K-12 substr. MG1655
Description:gi_16130723
Residue:608
BDBM58879
NameBDBM58879
Synonyms:1-(4-methylbenzyl)-2,4,6-tris(p-tolyl)pyridin-1-ium;perchlorate MLS001240943 cid_12647563
TypeSmall organic molecule
Emp. Form.C34H32N
Mol. Mass.454.624
SMILESCc1ccc(C[n+]2c(cc(cc2-c2ccc(C)cc2)-c2ccc(C)cc2)-c2ccc(C)cc2)cc1