Reaction Details
TargetRecBCD enzyme subunit RecD
LigandBDBM77607
Substrate/Competitorn/a
Meas. Tech.Counterscreen for AddAB inhibitors: absorbance-based bacterial cell-based high throughput dose response assay to identify inhibitors of RecBCD
IC50>39523±n/a nM
Citation PubChem, PC Counterscreen for AddAB inhibitors: absorbance-based bacterial cell-based high throughput dose response assay to identify inhibitors of RecBCD PubChem Bioassay(2010)[AID]
 
RecBCD enzyme subunit RecD
Name:RecBCD enzyme subunit RecD
Type:Enzyme Catalytic Domain
Mol. Mass.:66906.68
Organism:Escherichia coli str. K-12 substr. MG1655
Description:gi_16130723
Residue:608
BDBM77607
NameBDBM77607
Synonyms:2-(1,3-benzodioxol-5-yl)-N-[(5-nitro-2-furanyl)methylideneamino]acetamide 2-(1,3-benzodioxol-5-yl)-N-[(5-nitrofuran-2-yl)methylideneamino]acetamide MLS002251060 cid_1285782
TypeSmall organic molecule
Emp. Form.C14H11N3O6
Mol. Mass.317.2536
SMILES[O-][N+](=O)c1ccc(\C=N\NC(=O)Cc2ccc3OCOc3c2)o1