Reaction Details
TargetProtein-arginine deiminase type-4
LigandBDBM70488
Substrate/Competitorn/a
Meas. Tech.Fluorescence-based biochemical dose response assay to identify inhibitors of Protein Arginine Deiminase 4 (PAD4)
IC50 42000±n/a nM
Citation PubChem, PC Fluorescence-based biochemical dose response assay to identify inhibitors of Protein Arginine Deiminase 4 (PAD4) PubChem Bioassay(2010)[AID]
 
Protein-arginine deiminase type-4
Name:Protein-arginine deiminase type-4
Type:Enzyme Catalytic Domain
Mol. Mass.:74078.90
Organism:Homo sapiens (Human)
Description:gi_216548487
Residue:663
BDBM70488
NameBDBM70488
Synonyms:(3Z)-3-[hydroxy(methoxy)methylene]isoquinoline-1,4-quinone (3Z)-3-[methoxy(oxidanyl)methylidene]isoquinoline-1,4-dione SMR000113373 methyl 4-hydroxy-1-oxo-1,2-dihydro-3-isoquinolinecarboxylate
TypeSmall organic molecule
Emp. Form.C11H9NO4
Mol. Mass.219.1935
SMILESCOC(=O)c1[nH]c(=O)c2ccccc2c1O