Reaction Details
TargetProtein-arginine deiminase type-4
LigandBDBM77612
Substrate/Competitorn/a
Meas. Tech.Fluorescence-based biochemical dose response assay to identify inhibitors of Protein Arginine Deiminase 4 (PAD4)
IC50 75000±n/a nM
Citation PubChem, PC Fluorescence-based biochemical dose response assay to identify inhibitors of Protein Arginine Deiminase 4 (PAD4) PubChem Bioassay(2010)[AID]
 
Protein-arginine deiminase type-4
Name:Protein-arginine deiminase type-4
Type:Enzyme Catalytic Domain
Mol. Mass.:74078.90
Organism:Homo sapiens (Human)
Description:gi_216548487
Residue:663
BDBM77612
NameBDBM77612
Synonyms:10-hydroxy-9-phenanthrenecarboxaldehyde 10-oxidanylphenanthrene-9-carbaldehyde cid_3383009
TypeSmall organic molecule
Emp. Form.C15H10O2
Mol. Mass.222.2387
SMILESOc1c(C=O)c2ccccc2c2ccccc12