Reaction Details
TargetMitochondrial import inner membrane translocase subunit TIM10
LigandBDBM78434
Substrate/Competitorn/a
Meas. Tech.Dose Response confirmation of uHTS small molecule inhibitors of tim10-1 yeast via a luminescent assay
IC50 29100±n/a nM
Citation PubChem, PC Dose Response confirmation of uHTS small molecule inhibitors of tim10-1 yeast via a luminescent assay PubChem Bioassay(2010)[AID]
 
Mitochondrial import inner membrane translocase subunit TIM10
Name:Mitochondrial import inner membrane translocase subunit TIM10
Type:Enzyme Catalytic Domain
Mol. Mass.:10303.50
Organism:Saccharomyces cerevisiae S288c
Description:gi_285809906
Residue:93
BDBM78434
NameBDBM78434
Synonyms:2-chloranyl-10-[3-(4-methylpiperazin-1-yl)propyl]phenothiazine;ethane-1,2-disulfonic acid 2-chloro-10-[3-(4-methylpiperazin-1-yl)propyl]phenothiazine;ethane-1,2-disulfonic acid Compazine MLS001148133 SMR000653454 | cid_91499
TypeSmall organic molecule
Emp. Form.C20H24ClN3S
Mol. Mass.373.943
SMILESCN1CCN(CCCN2c3ccccc3Sc3ccc(Cl)cc23)CC1