Reaction Details
TargetBeta-secretase 1
LigandBDBM270566
Substrate/Competitorn/a
Meas. Tech.BACE1 Binding Assay
pH4.5±n/a
Temperature298.15±n/a K
Ki 3.60±n/a nM
Commentsextracted
Citation Juhl, KTagmose, LMarigo, M 2-amino-3,5-difluoro-3,6-dimethyl-6-phenyl-3,4,5,6-tetrahydropyridines as BACE1 inhibitors for treating alzheimer's disease US Patent US10059669 Publication Date 8/28/2018
 
Beta-secretase 1
Name:Beta-secretase 1
Type:Protein
Mol. Mass.:55755.10
Organism:Homo sapiens (Human)
Description:P56817
Residue:501
BDBM270566
NameBDBM270566
Synonyms:N-(3-((2R,3S,5S)-6-amino-3,5-difluoro-2,5-dimethyl-2,3,4,5-tetrahydropyridin-2-yl)-4,5-difluorophenyl)-5-(methoxy-d3)picolinamide | US10059669, Compound 22
TypeSmall organic molecule
Emp. Form.C20H20F4N4O2
Mol. Mass.424.392
SMILESCOc1ccc(nc1)C(=O)Nc1cc(F)c(F)c(c1)[C@@]1(C)N=C(N)[C@@](C)(F)C[C@@H]1F