Reaction Details
TargetUbiquitin-conjugating enzyme E2 N
LigandBDBM61402
Substrate/Competitorn/a
Meas. Tech.Dose Response confirmation of uHTS for the identification of UBC13 Polyubiquitin Inhibitors via a TR-FRET Assay
IC50>20000±0 nM
Citation PubChem, PC Dose Response confirmation of uHTS for the identification of UBC13 Polyubiquitin Inhibitors via a TR-FRET Assay PubChem Bioassay(2011)[AID]
 
Ubiquitin-conjugating enzyme E2 N
Name:Ubiquitin-conjugating enzyme E2 N
Type:PROTEIN
Mol. Mass.:17137.61
Organism:Homo sapiens (Human)
Description:EBI_101440
Residue:152
BDBM61402
NameBDBM61402
Synonyms:(Z)-2-butenedioic acid;2-(2,2-dicyclohexylethyl)piperidine 2-(2,2-dicyclohexylethyl)piperidine;maleic acid CHEMBL75880 Perhexiline cid_5284439 | perhexiline maleate
TypeSmall organic molecule
Emp. Form.C19H35N
Mol. Mass.277.4879
SMILESC(C(C1CCCCC1)C1CCCCC1)C1CCCCN1