Reaction Details
TargetUbiquitin-conjugating enzyme E2 N
LigandBDBM78805
Substrate/Competitorn/a
Meas. Tech.Dose Response confirmation of uHTS for the identification of UBC13 Polyubiquitin Inhibitors via a TR-FRET Assay
IC50 1677±94 nM
Citation PubChem, PC Dose Response confirmation of uHTS for the identification of UBC13 Polyubiquitin Inhibitors via a TR-FRET Assay PubChem Bioassay(2011)[AID]
 
Ubiquitin-conjugating enzyme E2 N
Name:Ubiquitin-conjugating enzyme E2 N
Type:PROTEIN
Mol. Mass.:17137.61
Organism:Homo sapiens (Human)
Description:EBI_101440
Residue:152
BDBM78805
NameBDBM78805
Synonyms:2-amino-4-methyl-N-(3-pyridinylmethylideneamino)-5-thiazolecarboxamide 2-amino-4-methyl-N-(pyridin-3-ylmethylideneamino)-1,3-thiazole-5-carboxamide MLS000710993 cid_772835
TypeSmall organic molecule
Emp. Form.C11H11N5OS
Mol. Mass.261.303
SMILESCc1nc(N)sc1C(=O)NN=Cc1cccnc1