Reaction Details
TargetUbiquitin-conjugating enzyme E2 N
LigandBDBM78626
Substrate/Competitorn/a
Meas. Tech.Dose Response confirmation of uHTS for the identification of UBC13 Polyubiquitin Inhibitors via a TR-FRET Assay reconfirm
IC50 1246±38 nM
Citation PubChem, PC Dose Response confirmation of uHTS for the identification of UBC13 Polyubiquitin Inhibitors via a TR-FRET Assay reconfirm PubChem Bioassay(2011)[AID]
 
Ubiquitin-conjugating enzyme E2 N
Name:Ubiquitin-conjugating enzyme E2 N
Type:PROTEIN
Mol. Mass.:17137.61
Organism:Homo sapiens (Human)
Description:EBI_101440
Residue:152
BDBM78626
NameBDBM78626
Synonyms:2-Amino-4-methyl-thiazole-5-carboxylic acid (1H-indol-3-ylmethylene)-hydrazide 2-amino-N'-[(Z)-indol-3-ylidenemethyl]-4-methyl-1,3-thiazole-5-carbohydrazide 2-azanyl-N'-[(Z)-indol-3-ylidenemethyl]-4-methyl-1,3-thiazole-5-carbohydrazide SMR000116208 | cid_6537515
TypeSmall organic molecule
Emp. Form.C14H13N5OS
Mol. Mass.299.351
SMILESCc1nc(N)sc1C(=O)NN=Cc1c[nH]c2ccccc12