Reaction Details
TargetUbiquitin-conjugating enzyme E2 N
LigandBDBM78759
Substrate/Competitorn/a
Meas. Tech.Dose Response confirmation of uHTS for the identification of UBC13 Polyubiquitin Inhibitors via a TR-FRET Assay reconfirm
IC50 1466±80 nM
Citation PubChem, PC Dose Response confirmation of uHTS for the identification of UBC13 Polyubiquitin Inhibitors via a TR-FRET Assay reconfirm PubChem Bioassay(2011)[AID]
 
Ubiquitin-conjugating enzyme E2 N
Name:Ubiquitin-conjugating enzyme E2 N
Type:PROTEIN
Mol. Mass.:17137.61
Organism:Homo sapiens (Human)
Description:EBI_101440
Residue:152
BDBM78759
NameBDBM78759
Synonyms:6-amino-4-(4-hydroxy-3,5-dimethoxy-phenyl)-3-(2-thienyl)-2,4-dihydropyrano[2,3-c]pyrazole-5-carbonitrile 6-azanyl-4-(3,5-dimethoxy-4-oxidanyl-phenyl)-3-thiophen-2-yl-2,4-dihydropyrano[2,3-c]pyrazole-5-carbonitrile SMR000275523 | cid_3155333
TypeSmall organic molecule
Emp. Form.C19H16N4O4S
Mol. Mass.396.42
SMILESCOc1cc(cc(OC)c1O)C1C(C#N)C(=N)Oc2[nH]nc(-c3cccs3)c12