Reaction Details
TargetUbiquitin-conjugating enzyme E2 N
LigandBDBM79201
Substrate/Competitorn/a
Meas. Tech.Dose Response confirmation of uHTS for the identification of UBC13 Polyubiquitin Inhibitors via a TR-FRET Assay reconfirm
IC50 1445±74 nM
Citation PubChem, PC Dose Response confirmation of uHTS for the identification of UBC13 Polyubiquitin Inhibitors via a TR-FRET Assay reconfirm PubChem Bioassay(2011)[AID]
 
Ubiquitin-conjugating enzyme E2 N
Name:Ubiquitin-conjugating enzyme E2 N
Type:PROTEIN
Mol. Mass.:17137.61
Organism:Homo sapiens (Human)
Description:EBI_101440
Residue:152
BDBM79201
NameBDBM79201
Synonyms:IK-IR SMR001230887 | cid_24978566
TypeSmall organic molecule
Emp. Form.C68H120N20O7
Mol. Mass.1329.8102
SMILES[#6]-[#6]-[#6@H](-[#6])-[#6]-c1cn(nn1)-[#6@@H](-[#6]-[#6]-[#6]-[#6]-[#7])-[#6](=O)-[#7]-[#6]-[#6]-[#6]-[#6]-[#6]-[#6]-[#6]-[#6]-[#6]-[#6]-[#6](=O)-[#7]-1-[#6]-[#6]-[#7](-[#6]-[#6]-1)-c1nc(-[#7]-[#6]-[#6]-[#8]-[#6]-[#6]-[#8]-[#6]-[#6]-[#8]-[#6]C#C)nc(n1)-[#7]-1-[#6]-[#6]-[#7](-[#6]-[#6]-1)-[#6](=O)-[#6]-[#6]-[#6]-[#6]-[#6]-[#6]-[#6]-[#6]-[#6]-[#6]-[#7]-[#6](=O)-[#6@H](-[#6]-[#6]-[#6]\[#7]=[#6](\[#7])-[#7])-n1cc(-[#6]-[#6@@H](-[#6])-[#6]-[#6])nn1