Reaction Details
TargetUbiquitin-conjugating enzyme E2 N
LigandBDBM59083
Substrate/Competitorn/a
Meas. Tech.Dose Response confirmation of uHTS for the identification of UBC13 Polyubiquitin Inhibitors via a TR-FRET Assay reconfirm
IC50 2987±197 nM
Citation PubChem, PC Dose Response confirmation of uHTS for the identification of UBC13 Polyubiquitin Inhibitors via a TR-FRET Assay reconfirm PubChem Bioassay(2011)[AID]
 
Ubiquitin-conjugating enzyme E2 N
Name:Ubiquitin-conjugating enzyme E2 N
Type:PROTEIN
Mol. Mass.:17137.61
Organism:Homo sapiens (Human)
Description:EBI_101440
Residue:152
BDBM59083
NameBDBM59083
Synonyms:MLS002154065 THONZONIUM BROMIDE cid_11102
TypeSmall organic molecule
Emp. Form.C32H55N4O
Mol. Mass.511.8048
[N+](C)(C)CCN(Cc1ccc(OC)cc1)c1ncccn1