Reaction Details
TargetPerilipin-5
LigandBDBM29532
Substrate/Competitorn/a
Meas. Tech.Luminescence-based biochemical high throughput dose response assay for inhibitors of the interaction of the lipase co-activator protein, abhydrolase domain
IC50 10232±n/a nM
Citation PubChem, PC Luminescence-based biochemical high throughput dose response assay for inhibitors of the interaction of the lipase co-activator protein, abhydrolase domain containing 5 (ABHD5) with perilipin-5 (MLDP; PLIN5) (2K validation set) PubChem Bioassay(2011)[AID]
 
Perilipin-5
Name:Perilipin-5
Type:Enzyme Catalytic Domain
Mol. Mass.:50774.20
Organism:Homo sapiens (Human)
Description:gi_116292172
Residue:463
BDBM29532
NameBDBM29532
Synonyms:(1E,6E)-1,7-bis(3-methoxy-4-oxidanyl-phenyl)hepta-1,6-diene-3,5-dione (1E,6E)-1,7-bis(4-hydroxy-3-methoxyphenyl)hepta-1,6-diene-3,5-dione CURCUMIN Diferuloylmethane Natural yellow 3 Turmeric yellow | cid_969516
TypeSmall organic molecule
Emp. Form.C21H20O6
Mol. Mass.368.3799
SMILESCOc1cc(C=CC(=O)CC(=O)C=Cc2ccc(O)c(OC)c2)ccc1O