Reaction Details
TargetDNA damage-inducible transcript 3 protein
LigandBDBM68061
Substrate/Competitorn/a
Meas. Tech.CHOP dose-response primary assay
IC50<160±n/a nM
Citation PubChem, PC CHOP dose-response primary assay PubChem Bioassay(2011)[AID]
 
DNA damage-inducible transcript 3 protein
Name:DNA damage-inducible transcript 3 protein
Type:Enzyme Catalytic Domain
Mol. Mass.:19175.17
Organism:Mus musculus
Description:gi_160707929
Residue:168
BDBM68061
NameBDBM68061
Synonyms:MLS000388719 N-ethyl-5-[1-(furan-2-ylmethyl)-2,5-dimethyl-pyrrol-3-yl]-6H-1,3,4-thiadiazin-2-amine SMR000254892 ethyl-[5-[1-(2-furfuryl)-2,5-dimethyl-pyrrol-3-yl]-6H-1,3,4-thiadiazin-2-yl]amine
TypeSmall organic molecule
Emp. Form.C16H20N4OS
Mol. Mass.316.421
SMILESCCNC1=NN=C(CS1)c1cc(C)n(Cc2ccco2)c1C