Reaction Details
TargetDNA damage-inducible transcript 3 protein
LigandBDBM66502
Substrate/Competitorn/a
Meas. Tech.CHOP dose-response primary assay
IC50<160±n/a nM
Citation PubChem, PC CHOP dose-response primary assay PubChem Bioassay(2011)[AID]
 
DNA damage-inducible transcript 3 protein
Name:DNA damage-inducible transcript 3 protein
Type:Enzyme Catalytic Domain
Mol. Mass.:19175.17
Organism:Mus musculus
Description:gi_160707929
Residue:168
BDBM66502
NameBDBM66502
Synonyms:(2Z,6E)-4-tert-butyl-2,6-bis(2-pyridinylmethylidene)-1-cyclohexanone (2Z,6E)-4-tert-butyl-2,6-bis(pyridin-2-ylmethylene)cyclohexanone MLS000729946 cid_2059132
TypeSmall organic molecule
Emp. Form.C22H24N2O
Mol. Mass.332.4388
SMILESCC(C)(C)C1C\C(=C\c2ccccn2)C(=O)\C(C1)=C\c1ccccn1