Reaction Details
TargetDNA damage-inducible transcript 3 protein
LigandBDBM61541
Substrate/Competitorn/a
Meas. Tech.CHOP dose-response primary assay
IC50<160±n/a nM
Citation PubChem, PC CHOP dose-response primary assay PubChem Bioassay(2011)[AID]
 
DNA damage-inducible transcript 3 protein
Name:DNA damage-inducible transcript 3 protein
Type:Enzyme Catalytic Domain
Mol. Mass.:19175.17
Organism:Mus musculus
Description:gi_160707929
Residue:168
BDBM61541
NameBDBM61541
Synonyms:(Z)-2,3-bis(chloranyl)-3-[(2-chlorophenyl)methylsulfinyl]-N-(6-methoxypyridin-3-yl)prop-2-enamide (Z)-2,3-dichloro-3-[(2-chlorophenyl)methylsulfinyl]-N-(6-methoxy-3-pyridinyl)-2-propenamide 2,3-dichloro-3-[(2-chlorobenzyl)sulfinyl]-N-(6-methoxy-3-pyridinyl)acrylamide SMR000334342 | cid_1475345
TypeSmall organic molecule
Emp. Form.C16H13Cl3N2O3S
Mol. Mass.419.71
SMILESCOc1ccc(NC(=O)C(Cl)=C(Cl)S(=O)Cc2ccccc2Cl)cn1