Reaction Details
TargetDNA damage-inducible transcript 3 protein
LigandBDBM68172
Substrate/Competitorn/a
Meas. Tech.CHOP dose-response primary assay
IC50<160±n/a nM
Citation PubChem, PC CHOP dose-response primary assay PubChem Bioassay(2011)[AID]
 
DNA damage-inducible transcript 3 protein
Name:DNA damage-inducible transcript 3 protein
Type:Enzyme Catalytic Domain
Mol. Mass.:19175.17
Organism:Mus musculus
Description:gi_160707929
Residue:168
BDBM68172
NameBDBM68172
Synonyms:4-(dichloromethyl)-2-(4-nitrophenyl)quinazoline 4-[bis(chloranyl)methyl]-2-(4-nitrophenyl)quinazoline SMR000424835 | cid_911287
TypeSmall organic molecule
Emp. Form.C15H9Cl2N3O2
Mol. Mass.334.157
SMILES[O-][N+](=O)c1ccc(cc1)-c1nc(C(Cl)Cl)c2ccccc2n1