Reaction Details
TargetEpidermal growth factor receptor
LigandBDBM270571
Substrate/Competitorn/a
Meas. Tech.High Throughput EGFR Biochemical Assay
pH7±n/a
Temperature298.15±n/a K
IC50 11.0±n/a nM
Commentsextracted
Citation Balan, GChou, CKim, MKirschberg, TALink, JOPhillips, GSaito, RDSquires, NHTaylor, JGWatkins, WJWright, NE Cot modulators and methods of use thereof US Patent US10059695 Publication Date 8/28/2018
 
Epidermal growth factor receptor
Name:Epidermal growth factor receptor
Type:Receptor Kinase Domain
Mol. Mass.:134279.59
Organism:Homo sapiens (Human)
Description:P00533
Residue:1210
BDBM270571
NameBDBM270571
Synonyms:(S)-N6-((1- cyclopropyl-1H- 1,2,3-triazol-4-yl)(4- fluorophenyl)methyl- d)-N4-((4- methyltetrahydro- 2H-pyran-4- yl)methyl)quinazoline- 4,6-diamine US10577352, Compound I-3
TypeSmall organic molecule
Emp. Form.C27H30FN7O
Mol. Mass.487.5718
SMILESCC1(CNc2ncnc3ccc(NC(c4cn(nn4)C4CC4)c4ccc(F)cc4)cc23)CCOCC1