Reaction Details
TargetEpidermal growth factor receptor
LigandBDBM270573
Substrate/Competitorn/a
Meas. Tech.High Throughput EGFR Biochemical Assay
pH7±n/a
Temperature298.15±n/a K
IC50 53.0±n/a nM
Commentsextracted
Citation Balan, GChou, CKim, MKirschberg, TALink, JOPhillips, GSaito, RDSquires, NHTaylor, JGWatkins, WJWright, NE Cot modulators and methods of use thereof US Patent US10059695 Publication Date 8/28/2018
 
Epidermal growth factor receptor
Name:Epidermal growth factor receptor
Type:Receptor Kinase Domain
Mol. Mass.:134279.59
Organism:Homo sapiens (Human)
Description:P00533
Residue:1210
BDBM270573
NameBDBM270573
Synonyms:3-((6-(((S)-(1- cyclopropyl-1H- 1,2,3-triazol-4-yl)(4- fluorophenyl)methyl- d)amino)quinazolin- 4-yl)amino)-3- phenylpropanenitrile US10577352, Compound I-5
TypeSmall organic molecule
Emp. Form.C29H25FN8
Mol. Mass.504.5608
SMILESFc1ccc(cc1)C(Nc1ccc2ncnc(NC(CC#N)c3ccccc3)c2c1)c1cn(nn1)C1CC1