Reaction Details
TargetEpidermal growth factor receptor
LigandBDBM270583
Substrate/Competitorn/a
Meas. Tech.High Throughput EGFR Biochemical Assay
pH7±n/a
Temperature298.15±n/a K
IC50 2.60±n/a nM
Commentsextracted
Citation Balan, GChou, CKim, MKirschberg, TALink, JOPhillips, GSaito, RDSquires, NHTaylor, JGWatkins, WJWright, NE Cot modulators and methods of use thereof US Patent US10059695 Publication Date 8/28/2018
 
Epidermal growth factor receptor
Name:Epidermal growth factor receptor
Type:Receptor Kinase Domain
Mol. Mass.:134279.59
Organism:Homo sapiens (Human)
Description:P00533
Residue:1210
BDBM270583
NameBDBM270583
Synonyms:(S)-8-bromo-N6-((1- cyclopropyl-1H- 1,2,3-triazol-4-yl)(4- fluorophenyl)methyl- d)-N4- neopentylquinazoline- 4,6-diamine US10577352, Compound I-15
TypeSmall organic molecule
Emp. Form.C25H27BrFN7
Mol. Mass.524.431
SMILESCC(C)(C)CNc1ncnc2c(Br)cc(NC(c3cn(nn3)C3CC3)c3ccc(F)cc3)cc12