Reaction Details
TargetEpidermal growth factor receptor
LigandBDBM270585
Substrate/Competitorn/a
Meas. Tech.High Throughput EGFR Biochemical Assay
pH7±n/a
Temperature298.15±n/a K
IC50 3.30±n/a nM
Commentsextracted
Citation Balan, GChou, CKim, MKirschberg, TALink, JOPhillips, GSaito, RDSquires, NHTaylor, JGWatkins, WJWright, NE Cot modulators and methods of use thereof US Patent US10059695 Publication Date 8/28/2018
 
Epidermal growth factor receptor
Name:Epidermal growth factor receptor
Type:Receptor Kinase Domain
Mol. Mass.:134279.59
Organism:Homo sapiens (Human)
Description:P00533
Residue:1210
BDBM270585
NameBDBM270585
Synonyms:(S)-6- ((benzo[d]thiazol-7- yl(1-(1- (trifluoromethyl) cyclopropyl)-1H- 1,2,3-triazol-4- yl)methyl)amino)-4- (neopentylamino) quinazoline-8- carbonitrile US10577352, Compound I-17
TypeSmall organic molecule
Emp. Form.C28H26F3N9S
Mol. Mass.577.627
SMILESCC(C)(C)CNc1ncnc2c(cc(N[C@H](c3cn(nn3)C3(CC3)C(F)(F)F)c3cccc4ncsc34)cc12)C#N