Reaction Details
TargetEpidermal growth factor receptor
LigandBDBM270588
Substrate/Competitorn/a
Meas. Tech.High Throughput EGFR Biochemical Assay
pH7±n/a
Temperature298.15±n/a K
IC50 3.30±n/a nM
Commentsextracted
Citation Balan, GChou, CKim, MKirschberg, TALink, JOPhillips, GSaito, RDSquires, NHTaylor, JGWatkins, WJWright, NE Cot modulators and methods of use thereof US Patent US10059695 Publication Date 8/28/2018
 
Epidermal growth factor receptor
Name:Epidermal growth factor receptor
Type:Receptor Kinase Domain
Mol. Mass.:134279.59
Organism:Homo sapiens (Human)
Description:P00533
Residue:1210
BDBM270588
NameBDBM270588
Synonyms:(S)-6-(((2- chlorophenyl)(1-(1- cyanocyclopropyl)- 1H-1,2,3-triazol-4- yl)methyl-d)amino)- 4- (neopentylamino) quinazoline-8- carbonitrile US10577352, Compound I-20
TypeSmall organic molecule
Emp. Form.C27H26ClN9
Mol. Mass.512.009
SMILESCC(C)(C)CNc1ncnc2c(cc(NC(c3cn(nn3)C3(CC3)C#N)c3ccccc3Cl)cc12)C#N