Reaction Details
TargetEpidermal growth factor receptor
LigandBDBM270589
Substrate/Competitorn/a
Meas. Tech.High Throughput EGFR Biochemical Assay
pH7±n/a
Temperature298.15±n/a K
IC50 1.90±n/a nM
Commentsextracted
Citation Balan, GChou, CKim, MKirschberg, TALink, JOPhillips, GSaito, RDSquires, NHTaylor, JGWatkins, WJWright, NE Cot modulators and methods of use thereof US Patent US10059695 Publication Date 8/28/2018
 
Epidermal growth factor receptor
Name:Epidermal growth factor receptor
Type:Receptor Kinase Domain
Mol. Mass.:134279.59
Organism:Homo sapiens (Human)
Description:P00533
Residue:1210
BDBM270589
NameBDBM270589
Synonyms:(S)-8-chloro-N6-((1- (1- (difluoromethyl) cyclopropyl)-1H-1,2,3- triazol-4-yl)(6- fluoro-2- melhylpyridin-3- yl)methyl)-N4- neopentylquinazoline- 4,6-diamine US10577352, Compound I-21
TypeSmall organic molecule
Emp. Form.C26H28ClF3N8
Mol. Mass.545.002
SMILESCc1nc(F)ccc1[C@H](Nc1cc(Cl)c2ncnc(NCC(C)(C)C)c2c1)c1cn(nn1)C1(CC1)C(F)F