Reaction Details
TargetEpidermal growth factor receptor
LigandBDBM270590
Substrate/Competitorn/a
Meas. Tech.High Throughput EGFR Biochemical Assay
pH7±n/a
Temperature298.15±n/a K
IC50 1.70±n/a nM
Commentsextracted
Citation Balan, GChou, CKim, MKirschberg, TALink, JOPhillips, GSaito, RDSquires, NHTaylor, JGWatkins, WJWright, NE Cot modulators and methods of use thereof US Patent US10059695 Publication Date 8/28/2018
 
Epidermal growth factor receptor
Name:Epidermal growth factor receptor
Type:Receptor Kinase Domain
Mol. Mass.:134279.59
Organism:Homo sapiens (Human)
Description:P00533
Residue:1210
BDBM270590
NameBDBM270590
Synonyms:(S)-6-(((1-(1- (difluoromethyl) cyclopropyl)-1H-1,2,3- triazol-4-yl)(6- fluoro-2- methylpyridin-3- yl)methyl)amino)-4- (neopentylamino) quinazoline-8- carbonitrile US10577352, Compound I-22
TypeSmall organic molecule
Emp. Form.C27H28F3N9
Mol. Mass.535.5667
SMILESCc1nc(F)ccc1[C@H](Nc1cc(C#N)c2ncnc(NCC(C)(C)C)c2c1)c1cn(nn1)C1(CC1)C(F)F