Reaction Details
TargetEpidermal growth factor receptor
LigandBDBM270591
Substrate/Competitorn/a
Meas. Tech.High Throughput EGFR Biochemical Assay
pH7±n/a
Temperature298.15±n/a K
IC50 1.60±n/a nM
Commentsextracted
Citation Balan, GChou, CKim, MKirschberg, TALink, JOPhillips, GSaito, RDSquires, NHTaylor, JGWatkins, WJWright, NE Cot modulators and methods of use thereof US Patent US10059695 Publication Date 8/28/2018
 
Epidermal growth factor receptor
Name:Epidermal growth factor receptor
Type:Receptor Kinase Domain
Mol. Mass.:134279.59
Organism:Homo sapiens (Human)
Description:P00533
Residue:1210
BDBM270591
NameBDBM270591
Synonyms:(S)-3-(((8-chloro-4- (neopentylamino) quinazolin-6- yl)amino)(1-(1- (difluoromethyl) cyclopropyl)-1H-1,2,3- triazol-4-yl)methyl)- 2-methylbenzonitrile US10577352, Compound I-23
TypeSmall organic molecule
Emp. Form.C28H29ClF2N8
Mol. Mass.551.033
SMILESCc1c(cccc1[C@H](Nc1cc(Cl)c2ncnc(NCC(C)(C)C)c2c1)c1cn(nn1)C1(CC1)C(F)F)C#N