Reaction Details
TargetEpidermal growth factor receptor
LigandBDBM270599
Substrate/Competitorn/a
Meas. Tech.High Throughput EGFR Biochemical Assay
pH7±n/a
Temperature298.15±n/a K
IC50 72.0±n/a nM
Commentsextracted
Citation Balan, GChou, CKim, MKirschberg, TALink, JOPhillips, GSaito, RDSquires, NHTaylor, JGWatkins, WJWright, NE Cot modulators and methods of use thereof US Patent US10059695 Publication Date 8/28/2018
 
Epidermal growth factor receptor
Name:Epidermal growth factor receptor
Type:Receptor Kinase Domain
Mol. Mass.:134279.59
Organism:Homo sapiens (Human)
Description:P00533
Residue:1210
BDBM270599
NameBDBM270599
Synonyms:(S)-N6-((1-(1-(tert- butyl)piperidin-4- yl)-1H-1,2,3-triazol- 4-yl)(4- chlorophenyl) methyl)-N4-(3- chloro-4- fluorophenyl) quinazoline- 4,6-diamine US10577352, Compound II-5
TypeSmall organic molecule
Emp. Form.C32H33Cl2FN8
Mol. Mass.619.562
SMILESCC(C)(C)N1CCC(CC1)n1cc(nn1)[C@@H](Nc1ccc2ncnc(Nc3ccc(F)c(Cl)c3)c2c1)c1ccc(Cl)cc1