Reaction Details
TargetEpidermal growth factor receptor
LigandBDBM270605
Substrate/Competitorn/a
Meas. Tech.High Throughput EGFR Biochemical Assay
pH7±n/a
Temperature298.15±n/a K
IC50 74.0±n/a nM
Commentsextracted
Citation Balan, GChou, CKim, MKirschberg, TALink, JOPhillips, GSaito, RDSquires, NHTaylor, JGWatkins, WJWright, NE Cot modulators and methods of use thereof US Patent US10059695 Publication Date 8/28/2018
 
Epidermal growth factor receptor
Name:Epidermal growth factor receptor
Type:Receptor Kinase Domain
Mol. Mass.:134279.59
Organism:Homo sapiens (Human)
Description:P00533
Residue:1210
BDBM270605
NameBDBM270605
Synonyms:(S)-N6-((1- cyclopropyl-1H- 1,2,3-triazol-4-yl)(4- fluorophenyl)methyl- d)-N4-(5,6- difluoropyridin-3- yl)quinazoline-4,6- diamine US10577352, Compound II-11
TypeSmall organic molecule
Emp. Form.C25H19F3N8
Mol. Mass.488.4672
SMILESFc1ccc(cc1)C(Nc1ccc2ncnc(Nc3cnc(F)c(F)c3)c2c1)c1cn(nn1)C1CC1