Reaction Details
TargetBeta-adrenergic receptor kinase 1
LigandBDBM79499
Substrate/Competitorn/a
Meas. Tech.Dose Response of inhibitors of GRK2 binding with RNA aptamer, Cherry Pick 1
EC50 9420±n/a nM
Citation PubChem, PC Dose Response of inhibitors of GRK2 binding with RNA aptamer, Cherry Pick 1 PubChem Bioassay(2011)[AID]
 
Beta-adrenergic receptor kinase 1
Name:Beta-adrenergic receptor kinase 1
Type:Enzyme
Mol. Mass.:79581.30
Organism:Homo sapiens (Human)
Description:P25098
Residue:689
BDBM79499
NameBDBM79499
Synonyms:MLS001004100 N-[2-(4-oxidanylidene-3-phenyl-quinazolin-2-yl)sulfanylethanoyl]-2-(2-oxidanylidenepyrrolidin-1-yl)ethanamide N-[2-[(4-keto-3-phenyl-quinazolin-2-yl)thio]acetyl]-2-(2-ketopyrrolidino)acetamide cid_2566682
TypeSmall organic molecule
Emp. Form.C22H20N4O4S
Mol. Mass.436.484
SMILESO=C(CSc1nc2ccccc2c(=O)n1-c1ccccc1)NC(=O)CN1CCCC1=O