Reaction Details
TargetBeta-adrenergic receptor kinase 1
LigandBDBM79500
Substrate/Competitorn/a
Meas. Tech.Dose Response of inhibitors of GRK2 binding with RNA aptamer, Cherry Pick 1
EC50 12500±n/a nM
Citation PubChem, PC Dose Response of inhibitors of GRK2 binding with RNA aptamer, Cherry Pick 1 PubChem Bioassay(2011)[AID]
 
Beta-adrenergic receptor kinase 1
Name:Beta-adrenergic receptor kinase 1
Type:Enzyme
Mol. Mass.:79581.30
Organism:Homo sapiens (Human)
Description:P25098
Residue:689
BDBM79500
NameBDBM79500
Synonyms:(8R)-3-[3-(2-methylprop-2-enoylamino)phenyl]-7-(phenylcarbonyl)-1-oxa-2,7-diazaspiro[4.4]non-2-ene-8-carboxamide (8R)-7-benzoyl-3-[3-(2-methylprop-2-enoylamino)phenyl]-1-oxa-2,7-diazaspiro[4.4]non-2-ene-8-carboxamide MLS000561979 cid_16681845
TypeSmall organic molecule
Emp. Form.C24H24N4O4
Mol. Mass.432.4718
SMILESCC(=C)C(=O)Nc1cccc(c1)C1=NOC2(C[C@@H](N(C2)C(=O)c2ccccc2)C(N)=O)C1