Reaction Details
TargetBeta-adrenergic receptor kinase 1
LigandBDBM79501
Substrate/Competitorn/a
Meas. Tech.Dose Response of inhibitors of GRK2 binding with RNA aptamer, Cherry Pick 1
EC50 10620±n/a nM
Citation PubChem, PC Dose Response of inhibitors of GRK2 binding with RNA aptamer, Cherry Pick 1 PubChem Bioassay(2011)[AID]
 
Beta-adrenergic receptor kinase 1
Name:Beta-adrenergic receptor kinase 1
Type:Enzyme
Mol. Mass.:79581.30
Organism:Homo sapiens (Human)
Description:P25098
Residue:689
BDBM79501
NameBDBM79501
Synonyms:(8S)-7-(3,5-dinitrobenzoyl)-3-(3-methacrylamidophenyl)-1-oxa-2,7-diazaspiro[4.4]non-2-ene-8-carboxamide (8S)-7-(3,5-dinitrophenyl)carbonyl-3-[3-(2-methylprop-2-enoylamino)phenyl]-1-oxa-2,7-diazaspiro[4.4]non-2-ene-8-carboxamide MLS000561997 cid_16681940
TypeSmall organic molecule
Emp. Form.C24H22N6O8
Mol. Mass.522.4669
SMILESCC(=C)C(=O)Nc1cccc(c1)[C+]1CC2(CC(N(C2)C(=O)c2cc(cc(c2)[N+]([O-])=O)[N+]([O-])=O)C(N)=O)O[N-]1