Reaction Details
TargetBeta-adrenergic receptor kinase 1
LigandBDBM79503
Substrate/Competitorn/a
Meas. Tech.Dose Response of inhibitors of GRK2 binding with RNA aptamer, Cherry Pick 1
EC50 4380±n/a nM
Citation PubChem, PC Dose Response of inhibitors of GRK2 binding with RNA aptamer, Cherry Pick 1 PubChem Bioassay(2011)[AID]
 
Beta-adrenergic receptor kinase 1
Name:Beta-adrenergic receptor kinase 1
Type:Enzyme
Mol. Mass.:79581.30
Organism:Homo sapiens (Human)
Description:P25098
Residue:689
BDBM79503
NameBDBM79503
Synonyms:(8S)-3-[3-(caproylamino)phenyl]-7-p-anisoyl-1-oxa-2,7-diazaspiro[4.4]non-2-ene-8-carboxamide (8S)-3-[3-(hexanoylamino)phenyl]-7-(4-methoxyphenyl)carbonyl-1-oxa-2,7-diazaspiro[4.4]non-2-ene-8-carboxamide MLS000561965 cid_16745480
TypeSmall organic molecule
Emp. Form.C27H32N4O5
Mol. Mass.492.5668
SMILESCCCCCC(=O)Nc1cccc(c1)C1=NOC2(C[C@H](N(C2)C(=O)c2ccc(OC)cc2)C(N)=O)C1