Reaction Details
TargetBeta-adrenergic receptor kinase 1
LigandBDBM79508
Substrate/Competitorn/a
Meas. Tech.Dose Response of inhibitors of GRK2 binding with RNA aptamer, Cherry Pick 1
EC50 700±n/a nM
Citation PubChem, PC Dose Response of inhibitors of GRK2 binding with RNA aptamer, Cherry Pick 1 PubChem Bioassay(2011)[AID]
 
Beta-adrenergic receptor kinase 1
Name:Beta-adrenergic receptor kinase 1
Type:Enzyme
Mol. Mass.:79581.30
Organism:Homo sapiens (Human)
Description:P25098
Residue:689
BDBM79508
NameBDBM79508
Synonyms:3-(4-bromophenyl)sulfonyl-N-[(4-methoxyphenyl)methyl]propanamide MLS001030305 cid_4293404
TypeSmall organic molecule
Emp. Form.C17H18BrNO4S
Mol. Mass.412.298
SMILESCOc1ccc(CNC(=O)CCS(=O)(=O)c2ccc(Br)cc2)cc1