Reaction Details
TargetProtein Mdm4
LigandBDBM79632
Substrate/Competitorn/a
Meas. Tech.Dose Response confirmation of Inhibitors of Mdm2/MdmX interaction in luminescent format
IC50 3580±n/a nM
Citation PubChem, PC Dose Response confirmation of Inhibitors of Mdm2/MdmX interaction in luminescent format PubChem Bioassay(2011)[AID]
 
Protein Mdm4
Name:Protein Mdm4
Type:Oncoprotein
Mol. Mass.:54842.04
Organism:Homo sapiens (Human)
Description:The HDMX(1-188) were expressed in Escherichia coli BL21 (DE3) as a GST fusion and purified on glutathione sepharose.
Residue:490
BDBM79632
NameBDBM79632
Synonyms:2-hydroxy-6-isopropyl-cyclohepta-2,4,6-trien-1-one 2-hydroxy-6-propan-2-ylcyclohepta-2,4,6-trien-1-one MLS001048906 US9790158, 9 | cid_3611
TypeSmall organic molecule
Emp. Form.C10H12O2
Mol. Mass.164.2011
SMILESCC(C)c1cccc(O)c(=O)c1