Reaction Details
TargetBRCA1-associated RING domain protein 1
LigandBDBM79632
Substrate/Competitorn/a
Meas. Tech.Dose Response confirmation of Inhibitors of Mdm2/MdmX interaction using a Brca1/Bard1 BiLC Counterscreen assay
IC50 3890±n/a nM
Citation PubChem, PC Dose Response confirmation of Inhibitors of Mdm2/MdmX interaction using a Brca1/Bard1 BiLC Counterscreen assay PubChem Bioassay(2011)[AID]
 
BRCA1-associated RING domain protein 1
Name:BRCA1-associated RING domain protein 1
Type:Enzyme Catalytic Domain
Mol. Mass.:86678.08
Organism:Homo sapiens (Human)
Description:gi_116241265
Residue:777
BDBM79632
NameBDBM79632
Synonyms:2-hydroxy-6-isopropyl-cyclohepta-2,4,6-trien-1-one 2-hydroxy-6-propan-2-ylcyclohepta-2,4,6-trien-1-one MLS001048906 US9790158, 9 | cid_3611
TypeSmall organic molecule
Emp. Form.C10H12O2
Mol. Mass.164.2011
SMILESCC(C)c1cccc(O)c(=O)c1