Reaction Details
TargetBcl-2-related protein A1
LigandBDBM51914
Substrate/Competitorn/a
Meas. Tech.Dose Response confirmation of UBC13 Polyubiquitin Inhibitors using a Bfl-1 counterscreen
IC50 550±40 nM
Citation PubChem, PC Dose Response confirmation of UBC13 Polyubiquitin Inhibitors using a Bfl-1 counterscreen PubChem Bioassay(2011)[AID]
 
Bcl-2-related protein A1
Name:Bcl-2-related protein A1
Type:Apoptosis regulator protein
Mol. Mass.:19909.74
Organism:Mus musculus (Mouse)
Description:gi_11024684
Residue:172
BDBM51914
NameBDBM51914
Synonyms:2-(diethylamino)ethyl 4-[[(Z)-2-cyano-2-[4-(2-oxidanylidenechromen-3-yl)-1,3-thiazol-2-yl]ethenyl]amino]benzoate 4-[[(Z)-2-cyano-2-[4-(2-ketochromen-3-yl)thiazol-2-yl]vinyl]amino]benzoic acid 2-(diethylamino)ethyl ester MLS001164950 cid_1837712
TypeSmall organic molecule
Emp. Form.C28H26N4O4S
Mol. Mass.514.595
SMILESCCN(CC)CCOC(=O)c1ccc(cc1)N=CC(C#N)c1nc(cs1)-c1cc2ccccc2oc1=O