Reaction Details
TargetTropomyosin alpha-1 chain
LigandBDBM53515
Substrate/Competitorn/a
Meas. Tech.Fluorescence-based biochemical high throughput dose response assay for activators of the calcium sensitivity of cardiac Regulated Thin Filaments (RTF)
EC50>71476±n/a nM
Citation PubChem, PC Fluorescence-based biochemical high throughput dose response assay for activators of the calcium sensitivity of cardiac Regulated Thin Filaments (RTF) PubChem Bioassay(2011)[AID]
 
Tropomyosin alpha-1 chain
Name:Tropomyosin alpha-1 chain
Type:Enzyme Catalytic Domain
Mol. Mass.:32681.01
Organism:Sus scrofa
Description:P42639
Residue:284
BDBM53515
NameBDBM53515
Synonyms:2-[4-[hydroxy(methylcarbamoyl)amino]-2-keto-3,5,5-trimethyl-imidazolidin-1-yl]acetic acid methyl ester MLS000038306 cid_658537 methyl 2-[4-[hydroxy(methylcarbamoyl)amino]-3,5,5-trimethyl-2-oxoimidazolidin-1-yl]acetate
TypeSmall organic molecule
Emp. Form.C11H20N4O5
Mol. Mass.288.3003
SMILESCNC(=O)N(O)C1N(C)C(=O)N(CC(=O)OC)C1(C)C