Reaction Details
TargetTropomyosin alpha-1 chain
LigandBDBM79645
Substrate/Competitorn/a
Meas. Tech.Fluorescence-based biochemical high throughput dose response assay for activators of the calcium sensitivity of cardiac Regulated Thin Filaments (RTF)
EC50>71470±n/a nM
Citation PubChem, PC Fluorescence-based biochemical high throughput dose response assay for activators of the calcium sensitivity of cardiac Regulated Thin Filaments (RTF) PubChem Bioassay(2011)[AID]
 
Tropomyosin alpha-1 chain
Name:Tropomyosin alpha-1 chain
Type:Enzyme Catalytic Domain
Mol. Mass.:32681.01
Organism:Sus scrofa
Description:P42639
Residue:284
BDBM79645
NameBDBM79645
Synonyms:1-(2,5-dimethylphenyl)-2-[(5-isopropyl-1H-1,2,4-triazol-3-yl)thio]ethanone 1-(2,5-dimethylphenyl)-2-[(5-propan-2-yl-1H-1,2,4-triazol-3-yl)thio]ethanone SMR000067398 | cid_2096720
TypeSmall organic molecule
Emp. Form.C15H19N3OS
Mol. Mass.289.396
SMILESCC(C)c1nnc(SCC(=O)c2cc(C)ccc2C)[nH]1