Reaction Details
TargetTropomyosin alpha-1 chain
LigandBDBM50322732
Substrate/Competitorn/a
Meas. Tech.Fluorescence-based biochemical high throughput dose response assay for activators of the calcium sensitivity of cardiac Regulated Thin Filaments (RTF)
EC50>71542±n/a nM
Citation PubChem, PC Fluorescence-based biochemical high throughput dose response assay for activators of the calcium sensitivity of cardiac Regulated Thin Filaments (RTF) PubChem Bioassay(2011)[AID]
 
Tropomyosin alpha-1 chain
Name:Tropomyosin alpha-1 chain
Type:Enzyme Catalytic Domain
Mol. Mass.:32681.01
Organism:Sus scrofa
Description:P42639
Residue:284
BDBM50322732
NameBDBM50322732
Synonyms:2-(5-methylisoxazol-3-ylamino)-2-oxoethyl 2-(furan-2-carboxamido)-3-phenylpropanoate cid_3000182
TypeSmall organic molecule
Emp. Form.C20H19N3O6
Mol. Mass.397.3814
SMILESCc1cc(NC(=O)COC(=O)C(Cc2ccccc2)NC(=O)c2ccco2)no1