Reaction Details
TargetTropomyosin alpha-1 chain
LigandBDBM50881
Substrate/Competitorn/a
Meas. Tech.Fluorescence-based biochemical high throughput dose response assay for activators of the calcium sensitivity of cardiac Regulated Thin Filaments (RTF)
EC50 190.67±n/a nM
Citation PubChem, PC Fluorescence-based biochemical high throughput dose response assay for activators of the calcium sensitivity of cardiac Regulated Thin Filaments (RTF) PubChem Bioassay(2011)[AID]
 
Tropomyosin alpha-1 chain
Name:Tropomyosin alpha-1 chain
Type:Enzyme Catalytic Domain
Mol. Mass.:32681.01
Organism:Sus scrofa
Description:P42639
Residue:284
BDBM50881
NameBDBM50881
Synonyms:3-(2-chlorophenyl)-6-[4-(diethylamino)benzylidene][1,3]thiazolo[2,3-c][1,2,4]triazol-5(6H)-one 3-(2-chlorophenyl)-6-[[4-(diethylamino)phenyl]methylidene]-5-thiazolo[2,3-c][1,2,4]triazolone MLS000535086 cid_2936930
TypeSmall organic molecule
Emp. Form.C21H19ClN4OS
Mol. Mass.410.92
SMILESCCN(CC)c1ccc(C=c2sc3nnc(-c4ccccc4Cl)n3c2=O)cc1