Reaction Details
TargetTropomyosin alpha-1 chain
LigandBDBM66112
Substrate/Competitorn/a
Meas. Tech.Fluorescence-based biochemical high throughput dose response assay for activators of the calcium sensitivity of cardiac Regulated Thin Filaments (RTF)
EC50 742.02±n/a nM
Citation PubChem, PC Fluorescence-based biochemical high throughput dose response assay for activators of the calcium sensitivity of cardiac Regulated Thin Filaments (RTF) PubChem Bioassay(2011)[AID]
 
Tropomyosin alpha-1 chain
Name:Tropomyosin alpha-1 chain
Type:Enzyme Catalytic Domain
Mol. Mass.:32681.01
Organism:Sus scrofa
Description:P42639
Residue:284
BDBM66112
NameBDBM66112
Synonyms:(5E)-2-(p-tolyl)-5-veratrylidene-2-thiazolin-4-one (5E)-5-[(3,4-dimethoxyphenyl)methylidene]-2-(4-methylphenyl)-4-thiazolone MLS000557107 cid_1730305
TypeSmall organic molecule
Emp. Form.C19H17NO3S
Mol. Mass.339.408
SMILESCOc1ccc(\C=C2\SC(=NC2=O)c2ccc(C)cc2)cc1OC