Reaction Details
TargetTropomyosin alpha-1 chain
LigandBDBM79674
Substrate/Competitorn/a
Meas. Tech.Fluorescence-based biochemical high throughput dose response assay for activators of the calcium sensitivity of cardiac Regulated Thin Filaments (RTF)
EC50 3911±n/a nM
Citation PubChem, PC Fluorescence-based biochemical high throughput dose response assay for activators of the calcium sensitivity of cardiac Regulated Thin Filaments (RTF) PubChem Bioassay(2011)[AID]
 
Tropomyosin alpha-1 chain
Name:Tropomyosin alpha-1 chain
Type:Enzyme Catalytic Domain
Mol. Mass.:32681.01
Organism:Sus scrofa
Description:P42639
Residue:284
BDBM79674
NameBDBM79674
Synonyms:MLS000579105 N'-[(Z)-(3-ketobenzothiophen-2-ylidene)methyl]benzohydrazide N'-[(Z)-(3-oxo-1-benzothiophen-2-ylidene)methyl]benzohydrazide cid_5656784
TypeSmall organic molecule
Emp. Form.C16H12N2O2S
Mol. Mass.296.344
SMILESOc1c(C=NNC(=O)c2ccccc2)sc2ccccc12