Reaction Details
TargetTropomyosin alpha-1 chain
LigandBDBM79709
Substrate/Competitorn/a
Meas. Tech.Fluorescence-based biochemical high throughput dose response assay for activators of the calcium sensitivity of cardiac Regulated Thin Filaments (RTF)
EC50 1548±n/a nM
Citation PubChem, PC Fluorescence-based biochemical high throughput dose response assay for activators of the calcium sensitivity of cardiac Regulated Thin Filaments (RTF) PubChem Bioassay(2011)[AID]
 
Tropomyosin alpha-1 chain
Name:Tropomyosin alpha-1 chain
Type:Enzyme Catalytic Domain
Mol. Mass.:32681.01
Organism:Sus scrofa
Description:P42639
Residue:284
BDBM79709
NameBDBM79709
Synonyms:(5Z)-1,3-dimethyl-5-(3-methyl-4-pyrrolidino-benzylidene)-2-thioxo-4-imidazolidinone (5Z)-1,3-dimethyl-5-[(3-methyl-4-pyrrolidin-1-ylphenyl)methylidene]-2-sulfanylideneimidazolidin-4-one 1,3-dimethyl-5-[3-methyl-4-(1-pyrrolidinyl)benzylidene]-2-thioxo-4-imidazolidinone SMR000292355 | cid_891056
TypeSmall organic molecule
Emp. Form.C17H21N3OS
Mol. Mass.315.433
SMILESCN1C(=S)N(C)\C(=C/c2ccc(N3CCCC3)c(C)c2)C1=O