Reaction Details
TargetTropomyosin alpha-1 chain
LigandBDBM51191
Substrate/Competitorn/a
Meas. Tech.Fluorescence-based biochemical high throughput dose response assay for activators of the calcium sensitivity of cardiac Regulated Thin Filaments (RTF)
EC50 2177±n/a nM
Citation PubChem, PC Fluorescence-based biochemical high throughput dose response assay for activators of the calcium sensitivity of cardiac Regulated Thin Filaments (RTF) PubChem Bioassay(2011)[AID]
 
Tropomyosin alpha-1 chain
Name:Tropomyosin alpha-1 chain
Type:Enzyme Catalytic Domain
Mol. Mass.:32681.01
Organism:Sus scrofa
Description:P42639
Residue:284
BDBM51191
NameBDBM51191
Synonyms:(Z)-[2-keto-4-(3-methylpyridin-1-ium-1-yl)-3-thiazolin-5-ylidene]methanolate (Z)-[4-(3-methylpyridin-1-ium-1-yl)-2-oxidanylidene-1,3-thiazol-5-ylidene]methanolate MLS000710654 cid_16195045
TypeSmall organic molecule
Emp. Form.C10H8N2O2S
Mol. Mass.220.248
SMILESCc1ccc[n+](c1)-c1[n-]c(=O)sc1C=O