Reaction Details
TargetTropomyosin alpha-1 chain
LigandBDBM46797
Substrate/Competitorn/a
Meas. Tech.Fluorescence-based biochemical high throughput dose response assay for activators of the calcium sensitivity of cardiac Regulated Thin Filaments (RTF)
EC50 1863±n/a nM
Citation PubChem, PC Fluorescence-based biochemical high throughput dose response assay for activators of the calcium sensitivity of cardiac Regulated Thin Filaments (RTF) PubChem Bioassay(2011)[AID]
 
Tropomyosin alpha-1 chain
Name:Tropomyosin alpha-1 chain
Type:Enzyme Catalytic Domain
Mol. Mass.:32681.01
Organism:Sus scrofa
Description:P42639
Residue:284
BDBM46797
NameBDBM46797
Synonyms:MLS000730367 N'-(3-allyl-2,4-diketo-7-methyl-1H-benzo[g]pteridin-8-yl)-N,N-dimethyl-formamidine N,N-dimethyl-N'-[7-methyl-2,4-bis(oxidanylidene)-3-prop-2-enyl-1H-benzo[g]pteridin-8-yl]methanimidamide cid_6621522
TypeSmall organic molecule
Emp. Form.C17H18N6O2
Mol. Mass.338.3638
SMILESCN(C)C=Nc1cc2nc3[nH]c(=O)n(CC=C)c(=O)c3nc2cc1C