Reaction Details
TargetTropomyosin alpha-1 chain
LigandBDBM50644
Substrate/Competitorn/a
Meas. Tech.Fluorescence-based biochemical high throughput dose response assay for activators of the calcium sensitivity of cardiac Regulated Thin Filaments (RTF)
EC50 3934±n/a nM
Citation PubChem, PC Fluorescence-based biochemical high throughput dose response assay for activators of the calcium sensitivity of cardiac Regulated Thin Filaments (RTF) PubChem Bioassay(2011)[AID]
 
Tropomyosin alpha-1 chain
Name:Tropomyosin alpha-1 chain
Type:Enzyme Catalytic Domain
Mol. Mass.:32681.01
Organism:Sus scrofa
Description:P42639
Residue:284
BDBM50644
NameBDBM50644
Synonyms:7,9-bis(chloranyl)-4-[[(4-methoxyphenyl)amino]methylidene]-8-oxidanyl-1,2-dihydrodibenzofuran-3-one 7,9-dichloro-8-hydroxy-4-[(4-methoxyanilino)methylidene]-1,2-dihydrodibenzofuran-3-one SMR000529015 | cid_342330
TypeSmall organic molecule
Emp. Form.C20H15Cl2NO4
Mol. Mass.404.243
SMILESCOc1ccc(NC=C2c3oc4cc(Cl)c(O)c(Cl)c4c3CCC2=O)cc1