Reaction Details
TargetDNA dC->dU-editing enzyme APOBEC-3G
LigandBDBM34510
Substrate/Competitorn/a
Meas. Tech.Dose Response confirmation of small molecule APOBEC3G DNA Deaminase Inhibitors via a fluorescence-based single-stranded DNA deaminase assay
Temperature298.15±n/a K
IC50 6170±n/a nM
Commentsextracted
Citation PubChem, PC Dose Response confirmation of small molecule APOBEC3G DNA Deaminase Inhibitors via a fluorescence-based single-stranded DNA deaminase assay PubChem Bioassay(2011)[AID]
 
DNA dC->dU-editing enzyme APOBEC-3G
Name:DNA dC->dU-editing enzyme APOBEC-3G
Type:Enzyme Catalytic Domain
Mol. Mass.:46419.54
Organism:Homo sapiens (Human)
Description:gi_13399304
Residue:384
BDBM34510
NameBDBM34510
Synonyms:1-[2-(3-keto-4,6-dimethyl-isothiazolo[5,4-b]pyridin-2-yl)acetyl]nipecotic acid ethyl ester MLS000118886 cid_5308606 ethyl 1-[2-(4,6-dimethyl-3-oxo-[1,2]thiazolo[5,4-b]pyridin-2-yl)acetyl]piperidine-3-carboxylate
TypeSmall organic molecule
Emp. Form.C18H23N3O4S
Mol. Mass.377.458
SMILESCCOC(=O)C1CCCN(C1)C(=O)Cn1sc2nc(C)cc(C)c2c1=O