Reaction Details
TargetDNA dC->dU-editing enzyme APOBEC-3G
LigandBDBM80161
Substrate/Competitorn/a
Meas. Tech.Dose Response confirmation of small molecule APOBEC3G DNA Deaminase Inhibitors via a fluorescence-based single-stranded DNA deaminase assay
Temperature298.15±n/a K
IC50 2350±n/a nM
Commentsextracted
Citation PubChem, PC Dose Response confirmation of small molecule APOBEC3G DNA Deaminase Inhibitors via a fluorescence-based single-stranded DNA deaminase assay PubChem Bioassay(2011)[AID]
 
DNA dC->dU-editing enzyme APOBEC-3G
Name:DNA dC->dU-editing enzyme APOBEC-3G
Type:Enzyme Catalytic Domain
Mol. Mass.:46419.54
Organism:Homo sapiens (Human)
Description:gi_13399304
Residue:384
BDBM80161
NameBDBM80161
Synonyms:3-(5-methyl-1H-pyrazol-3-yl)-4-[[(E)-3-phenylprop-2-enylidene]amino]-1H-1,2,4-triazole-5-thione MLS000331379 cid_1596860
TypeSmall organic molecule
Emp. Form.C15H14N6S
Mol. Mass.310.377
SMILESCc1cc(n[nH]1)-c1n[nH]c(=S)n1N=CC=Cc1ccccc1